Reaction Details
TargetHistone deacetylase 1
LigandBDBM50319220
Substrate/Competitorn/a
Meas. Tech.ChEMBL_633815 (CHEMBL1119893)
IC50 11±n/a nM
Citation Wang, HLim, ZYZhou, YNg, MLu, TLee, KSangthongpitag, KGoh, KCWang, XWu, XKhng, HHGoh, SKOng, WCBonday, ZSun, ET Acylurea connected straight chain hydroxamates as novel histone deacetylase inhibitors: Synthesis, SAR, and in vivo antitumor activity. Bioorg Med Chem Lett20:3314-21 (2010) 
 
Histone deacetylase 1
Name:Histone deacetylase 1
Type:Enzyme
Mol. Mass.:55090.27
Organism:Homo sapiens (Human)
Description:Q13547
Residue:482
BDBM50319220
NameBDBM50319220
Synonyms:6-[3-(3-amino-4-chloro-benzoyl)-ureido]-hexanoic acid hydroxyamide | CHEMBL1083100
TypeSmall organic molecule
Emp. Form.C14H19ClN4O4
Mol. Mass.342.778
SMILESNc1cc(ccc1Cl)C(=O)NC(=O)NCCCCCC(=O)NO