Reaction Details
TargetPeroxisome proliferator-activated receptor alpha
LigandBDBM50319275
Substrate/Competitorn/a
Meas. Tech.ChEMBL_633996 (CHEMBL1117969)
EC50 13000±n/a nM
Citation Urbahns, KWoltering, MNikolic, SPernerstorfer, JBischoff, HDittrich-Wengenroth, ELustig, K Glycine amides as PPARalpha agonists. Bioorg Med Chem Lett20:3376-9 (2010) 
 
Peroxisome proliferator-activated receptor alpha
Name:Peroxisome proliferator-activated receptor alpha
Type:Enzyme
Mol. Mass.:52222.08
Organism:Homo sapiens (Human)
Description:Q07869
Residue:468
BDBM50319275
NameBDBM50319275
Synonyms:2-(4-(((2-(benzylamino)-2-oxoethyl)(furan-2-ylmethyl)amino)methyl)phenoxy)-2-methylpropanoic acid | CHEMBL1084549
TypeSmall organic molecule
Emp. Form.C25H28N2O5
Mol. Mass.436.5002
SMILESCC(C)(Oc1ccc(CN(CC(=O)NCc2ccccc2)Cc2ccco2)cc1)C(O)=O