Reaction Details
TargetCyclin-dependent kinase 1
LigandBDBM50229973
Substrate/Competitorn/a
Meas. Tech.ChEMBL_634454 (CHEMBL1119480)
Ki 80±n/a nM
Citation Wang, SMidgley, CAScaërou, FGrabarek, JBGriffiths, GJackson, WKontopidis, GMcClue, SJMcInnes, CMeades, CMezna, MPlater, AStuart, IThomas, MPWood, GClarke, RGBlake, DGZheleva, DILane, DPJackson, RCGlover, DMFischer, PM Discovery of N-phenyl-4-(thiazol-5-yl)pyrimidin-2-amine aurora kinase inhibitors. J Med Chem53:4367-78 (2010) 
 
Cyclin-dependent kinase 1
Name:Cyclin-dependent kinase 1
Type:Enzyme Subunit
Mol. Mass.:34101.08
Organism:Homo sapiens (Human)
Description:P06493
Residue:297
BDBM50229973
NameBDBM50229973
Synonyms:(4-(2-Amino-4-methylthiazol-5-yl)pyrimidin-2-yl)-(3-nitrophenyl)amine CHEMBL298445 | [4-(2-AMINO-4-METHYL-THIAZOL-5-YL)-PYRIMIDIN-2-YL]-(3-NITRO-PHENYL)-AMINE
TypeSmall organic molecule
Emp. Form.C14H12N6O2S
Mol. Mass.328.349
SMILESCc1nc(N)sc1-c1ccnc(Nc2cccc(c2)[N+]([O-])=O)n1