Reaction Details
TargetCyclin-dependent kinase 1
LigandBDBM50319620
Substrate/Competitorn/a
Meas. Tech.ChEMBL_634454 (CHEMBL1119480)
Ki 240±n/a nM
Citation Wang, SMidgley, CAScaërou, FGrabarek, JBGriffiths, GJackson, WKontopidis, GMcClue, SJMcInnes, CMeades, CMezna, MPlater, AStuart, IThomas, MPWood, GClarke, RGBlake, DGZheleva, DILane, DPJackson, RCGlover, DMFischer, PM Discovery of N-phenyl-4-(thiazol-5-yl)pyrimidin-2-amine aurora kinase inhibitors. J Med Chem53:4367-78 (2010) 
 
Cyclin-dependent kinase 1
Name:Cyclin-dependent kinase 1
Type:Enzyme Subunit
Mol. Mass.:34101.08
Organism:Homo sapiens (Human)
Description:P06493
Residue:297
BDBM50319620
NameBDBM50319620
Synonyms:CHEMBL1084715 | N-(4-(4-(2-(Ethylamino)-4-methylthiazol-5-yl)pyrimidin-2-ylamino)benzyl)acetamide
TypeSmall organic molecule
Emp. Form.C19H22N6OS
Mol. Mass.382.483
SMILESCCNc1nc(C)c(s1)-c1ccnc(Nc2ccc(CNC(C)=O)cc2)n1