Reaction Details
TargetCyclin-dependent kinase 1
LigandBDBM50319616
Substrate/Competitorn/a
Meas. Tech.ChEMBL_634454 (CHEMBL1119480)
Ki>10000±n/a nM
Citation Wang, SMidgley, CAScaërou, FGrabarek, JBGriffiths, GJackson, WKontopidis, GMcClue, SJMcInnes, CMeades, CMezna, MPlater, AStuart, IThomas, MPWood, GClarke, RGBlake, DGZheleva, DILane, DPJackson, RCGlover, DMFischer, PM Discovery of N-phenyl-4-(thiazol-5-yl)pyrimidin-2-amine aurora kinase inhibitors. J Med Chem53:4367-78 (2010) 
 
Cyclin-dependent kinase 1
Name:Cyclin-dependent kinase 1
Type:Enzyme Subunit
Mol. Mass.:34101.08
Organism:Homo sapiens (Human)
Description:P06493
Residue:297
BDBM50319616
NameBDBM50319616
Synonyms:1-(4-(4-(4-(2-Amino-4-methylthiazol-5-yl)pyrimidin-2-ylamino)phenyl)piperazin-1-yl)ethanone | CHEMBL1084969
TypeSmall organic molecule
Emp. Form.C20H23N7OS
Mol. Mass.409.508
SMILESCC(=O)N1CCN(CC1)c1ccc(Nc2nccc(n2)-c2sc(N)nc2C)cc1