Reaction Details
TargetAurora kinase B
LigandBDBM50319626
Substrate/Competitorn/a
Meas. Tech.ChEMBL_634452 (CHEMBL1119478)
Ki 18±n/a nM
Citation Wang, SMidgley, CAScaërou, FGrabarek, JBGriffiths, GJackson, WKontopidis, GMcClue, SJMcInnes, CMeades, CMezna, MPlater, AStuart, IThomas, MPWood, GClarke, RGBlake, DGZheleva, DILane, DPJackson, RCGlover, DMFischer, PM Discovery of N-phenyl-4-(thiazol-5-yl)pyrimidin-2-amine aurora kinase inhibitors. J Med Chem53:4367-78 (2010) 
 
Aurora kinase B
Name:Aurora kinase B
Type:Protein
Mol. Mass.:39327.72
Organism:Homo sapiens (Human)
Description:Q96GD4
Residue:344
BDBM50319626
NameBDBM50319626
Synonyms:4-(2,4-Dimethylthiazol-5-yl)-N-(4-(4-(methylsulfonyl)piperazin-1-yl)phenyl)pyrimidin-2-amine | CHEMBL1083484
TypeSmall organic molecule
Emp. Form.C20H24N6O2S2
Mol. Mass.444.574
SMILESCc1nc(C)c(s1)-c1ccnc(Nc2ccc(cc2)N2CCN(CC2)S(C)(=O)=O)n1