Reaction Details
TargetAurora kinase A
LigandBDBM8066
Substrate/Competitorn/a
Meas. Tech.ChEMBL_634451 (CHEMBL1119477)
Ki 6.9±n/a nM
Citation Wang, SMidgley, CAScaërou, FGrabarek, JBGriffiths, GJackson, WKontopidis, GMcClue, SJMcInnes, CMeades, CMezna, MPlater, AStuart, IThomas, MPWood, GClarke, RGBlake, DGZheleva, DILane, DPJackson, RCGlover, DMFischer, PM Discovery of N-phenyl-4-(thiazol-5-yl)pyrimidin-2-amine aurora kinase inhibitors. J Med Chem53:4367-78 (2010) 
 
Aurora kinase A
Name:Aurora kinase A
Type:Serine/threonine-protein kinase
Mol. Mass.:45830.98
Organism:Homo sapiens (Human)
Description:O14965
Residue:403
BDBM8066
NameBDBM8066
Synonyms:2-Anilino-4-(thiazol-5-yl)pyrimidine deriv. 37 4-N-[4-(2,4-dimethyl-1,3-thiazol-5-yl)pyrimidin-2-yl]-1-N,1-N-dimethylbenzene-1,4-diamine | N-[4-(2,4-Dimethylthiazol-5-yl)pyrimidin-2-yl]N,N-dimethylbenzene-1,4-diamine
TypeSmall organic molecule
Emp. Form.C17H19N5S
Mol. Mass.325.431
SMILESCN(C)c1ccc(Nc2nccc(n2)-c2sc(C)nc2C)cc1