Reaction Details
TargetCyclin-dependent kinase 9
LigandBDBM50319627
Substrate/Competitorn/a
Meas. Tech.ChEMBL_634458 (CHEMBL1119484)
Ki 1153±n/a nM
Citation Wang, SMidgley, CAScaërou, FGrabarek, JBGriffiths, GJackson, WKontopidis, GMcClue, SJMcInnes, CMeades, CMezna, MPlater, AStuart, IThomas, MPWood, GClarke, RGBlake, DGZheleva, DILane, DPJackson, RCGlover, DMFischer, PM Discovery of N-phenyl-4-(thiazol-5-yl)pyrimidin-2-amine aurora kinase inhibitors. J Med Chem53:4367-78 (2010) 
 
Cyclin-dependent kinase 9
Name:Cyclin-dependent kinase 9
Type:Enzyme Subunit
Mol. Mass.:42789.13
Organism:Homo sapiens (Human)
Description:n/a
Residue:372
BDBM50319627
NameBDBM50319627
Synonyms:1-(4-(4-(4-(2,4-Dimethylthiazol-5-yl)pyrimidin-2-ylamino)phenyl)piperazin-1-yl)ethanone | CHEMBL1083786
TypeSmall organic molecule
Emp. Form.C21H24N6OS
Mol. Mass.408.52
SMILESCC(=O)N1CCN(CC1)c1ccc(Nc2nccc(n2)-c2sc(C)nc2C)cc1