Reaction Details
TargetCyclin-dependent kinase 9
LigandBDBM50319624
Substrate/Competitorn/a
Meas. Tech.ChEMBL_634458 (CHEMBL1119484)
Ki 337±n/a nM
Citation Wang, SMidgley, CAScaërou, FGrabarek, JBGriffiths, GJackson, WKontopidis, GMcClue, SJMcInnes, CMeades, CMezna, MPlater, AStuart, IThomas, MPWood, GClarke, RGBlake, DGZheleva, DILane, DPJackson, RCGlover, DMFischer, PM Discovery of N-phenyl-4-(thiazol-5-yl)pyrimidin-2-amine aurora kinase inhibitors. J Med Chem53:4367-78 (2010) 
 
Cyclin-dependent kinase 9
Name:Cyclin-dependent kinase 9
Type:Enzyme Subunit
Mol. Mass.:42789.13
Organism:Homo sapiens (Human)
Description:n/a
Residue:372
BDBM50319624
NameBDBM50319624
Synonyms:Aminopyrimidine, 4 N1-(4-(2,4-Dimethylthiazol-5-yl)pyrimidin-2-yl)benzene-1,4-diamine
TypeSmall organic molecule
Emp. Form.C15H15N5S
Mol. Mass.297.378
SMILESCc1nc(C)c(s1)-c1ccnc(Nc2ccc(N)cc2)n1