Reaction Details
TargetCyclin-dependent kinase 7
LigandBDBM50319626
Substrate/Competitorn/a
Meas. Tech.ChEMBL_634457 (CHEMBL1119483)
Ki>10000±n/a nM
Citation Wang, SMidgley, CAScaërou, FGrabarek, JBGriffiths, GJackson, WKontopidis, GMcClue, SJMcInnes, CMeades, CMezna, MPlater, AStuart, IThomas, MPWood, GClarke, RGBlake, DGZheleva, DILane, DPJackson, RCGlover, DMFischer, PM Discovery of N-phenyl-4-(thiazol-5-yl)pyrimidin-2-amine aurora kinase inhibitors. J Med Chem53:4367-78 (2010) 
 
Cyclin-dependent kinase 7
Name:Cyclin-dependent kinase 7
Type:Enzyme Subunit
Mol. Mass.:39047.01
Organism:Homo sapiens (Human)
Description:n/a
Residue:346
BDBM50319626
NameBDBM50319626
Synonyms:4-(2,4-Dimethylthiazol-5-yl)-N-(4-(4-(methylsulfonyl)piperazin-1-yl)phenyl)pyrimidin-2-amine | CHEMBL1083484
TypeSmall organic molecule
Emp. Form.C20H24N6O2S2
Mol. Mass.444.574
SMILESCc1nc(C)c(s1)-c1ccnc(Nc2ccc(cc2)N2CCN(CC2)S(C)(=O)=O)n1