Reaction Details
TargetVasopressin V1a receptor
LigandBDBM85095
Substrate/Competitorn/a
Meas. Tech.ChEMBL_634856 (CHEMBL1120488)
Ki 0.43±n/a nM
Citation Crombie, ALAntrilli, TMCampbell, BACrandall, DLFailli, AAHe, YKern, JCMoore, WJNogle, LMTrybulski, EJ Synthesis and evaluation of azabicyclo[3.2.1]octane derivatives as potent mixed vasopressin antagonists. Bioorg Med Chem Lett20:3742-5 (2010) 
 
Vasopressin V1a receptor
Name:Vasopressin V1a receptor
Type:Receptor
Mol. Mass.:46820.18
Organism:Homo sapiens (Human)
Description:P37288
Residue:418
BDBM85095
NameBDBM85095
Synonyms:CAS_151171 NSC_151171 | YM087
TypeSmall organic molecule
Emp. Form.C32H26N4O2
Mol. Mass.498.5744
SMILESCc1nc-2c(CCN(C(=O)c3ccc(NC(=O)c4ccccc4-c4ccccc4)cc3)c3ccccc-23)[nH]1