Reaction Details
TargetHemagglutinin
LigandBDBM50320025
Substrate/Competitorn/a
Meas. Tech.ChEMBL_635075 (CHEMBL1119385)
Kd 7.8±n/a nM
Citation Matsubara, TOnishi, ASaito, TShimada, AInoue, HTaki, TNagata, KOkahata, YSato, T Sialic acid-mimic peptides as hemagglutinin inhibitors for anti-influenza therapy. J Med Chem53:4441-9 (2010) 
 
Hemagglutinin
Name:Hemagglutinin
Type:PROTEIN
Mol. Mass.:63355.67
Organism:Influenza A virus (strain A/Puerto Rico/8/1934 H1N1)
Description:ChEMBL_795514
Residue:565
BDBM50320025
NameBDBM50320025
Synonyms:ARLSPTMVHPNGAQP | CHEMBL1084188
TypeSmall organic molecule
Emp. Form.C67H110N22O20S
Mol. Mass.1575.791
SMILESCSCC[C@H](NC(=O)[C@@H](NC(=O)[C@@H]1CCCN1C(=O)[C@H](CO)NC(=O)[C@H](CC(C)C)NC(=O)[C@H](CCCN=C(N)N)NC(=O)[C@@H](C)N)[C@@H](C)O)C(=O)N[C@@H](C(C)C)C(=O)N[C@@H](Cc1cnc[nH]1)C(=O)N1CCC[C@H]1C(=O)N[C@@H](CC(N)=O)C(=O)NCC(=O)N[C@@H](C)C(=O)N[C@@H](CCC(N)=O)C(=O)N1CCC[C@H]1C(O)=O