Reaction Details
TargetHemagglutinin
LigandBDBM50320027
Substrate/Competitorn/a
Meas. Tech.ChEMBL_635075 (CHEMBL1119385)
Kd 11±n/a nM
Citation Matsubara, TOnishi, ASaito, TShimada, AInoue, HTaki, TNagata, KOkahata, YSato, T Sialic acid-mimic peptides as hemagglutinin inhibitors for anti-influenza therapy. J Med Chem53:4441-9 (2010) 
 
Hemagglutinin
Name:Hemagglutinin
Type:PROTEIN
Mol. Mass.:63355.67
Organism:Influenza A virus (strain A/Puerto Rico/8/1934 H1N1)
Description:ChEMBL_795514
Residue:565
BDBM50320027
NameBDBM50320027
Synonyms:CHEMBL1084190 | GRPPDSVFRSRGWLS
TypeSmall organic molecule
Emp. Form.C76H117N25O21
Mol. Mass.1716.8971
SMILESCC(C)C[C@H](NC(=O)[C@H](Cc1c[nH]c2ccccc12)NC(=O)CNC(=O)[C@H](CCCN=C(N)N)NC(=O)[C@H](CO)NC(=O)[C@H](CCCN=C(N)N)NC(=O)[C@H](Cc1ccccc1)NC(=O)[C@@H](NC(=O)[C@H](CO)NC(=O)[C@H](CC(O)=O)NC(=O)[C@@H]1CCCN1C(=O)[C@@H]1CCCN1C(=O)[C@H](CCCN=C(N)N)NC(=O)CN)C(C)C)C(=O)N[C@@H](CO)C(O)=O