Reaction Details
Target5-hydroxytryptamine receptor 2A
LigandBDBM50108699
Substrate/Competitorn/a
Meas. Tech.ChEMBL_633900 (CHEMBL1120466)
Ki 0.42±n/a nM
Citation Ladduwahetty, TGilligan, MHumphries, AMerchant, KJFish, RMcAlister, GIvarsson, MDominguez, MO'Connor, DMacLeod, AM Non-basic ligands for aminergic GPCRs: the discovery and development diaryl sulfones as selective, orally bioavailable 5-HT2A receptor antagonists for the treatment of sleep disorders. Bioorg Med Chem Lett20:3708-12 (2010) 
 
5-hydroxytryptamine receptor 2A
Name:5-hydroxytryptamine receptor 2A
Type:undefined
Mol. Mass.:52607.65
Organism:Homo sapiens (Human)
Description:P28223
Residue:471
BDBM50108699
NameBDBM50108699
Synonyms:1-(2,4-difluorophenethyl)-4-(4-fluorophenylsulfonyl)piperidine 1-[2-(2,4-Difluoro-phenyl)-ethyl]-4-(4-fluoro-benzenesulfonyl)-piperidine | CHEMBL358075
TypeSmall organic molecule
Emp. Form.C19H20F3NO2S
Mol. Mass.383.428
SMILESFc1ccc(cc1)S(=O)(=O)C1CCN(CCc2ccc(F)cc2F)CC1