Reaction Details
Target5-hydroxytryptamine receptor 2A
LigandBDBM50320378
Substrate/Competitorn/a
Meas. Tech.ChEMBL_633900 (CHEMBL1120466)
Ki 2.1±n/a nM
Citation Ladduwahetty, TGilligan, MHumphries, AMerchant, KJFish, RMcAlister, GIvarsson, MDominguez, MO'Connor, DMacLeod, AM Non-basic ligands for aminergic GPCRs: the discovery and development diaryl sulfones as selective, orally bioavailable 5-HT2A receptor antagonists for the treatment of sleep disorders. Bioorg Med Chem Lett20:3708-12 (2010) 
 
5-hydroxytryptamine receptor 2A
Name:5-hydroxytryptamine receptor 2A
Type:undefined
Mol. Mass.:52607.65
Organism:Homo sapiens (Human)
Description:P28223
Residue:471
BDBM50320378
NameBDBM50320378
Synonyms:8-(4-(2,4-difluorophenethyl)piperidin-1-ylsulfonyl)quinoline | CHEMBL1082452
TypeSmall organic molecule
Emp. Form.C22H22F2N2O2S
Mol. Mass.416.484
SMILESFc1ccc(CCC2CCN(CC2)S(=O)(=O)c2cccc3cccnc23)c(F)c1