Reaction Details
Target5-hydroxytryptamine receptor 2A
LigandBDBM50185780
Substrate/Competitorn/a
Meas. Tech.ChEMBL_633900 (CHEMBL1120466)
Ki 3.9±n/a nM
Citation Ladduwahetty, TGilligan, MHumphries, AMerchant, KJFish, RMcAlister, GIvarsson, MDominguez, MO'Connor, DMacLeod, AM Non-basic ligands for aminergic GPCRs: the discovery and development diaryl sulfones as selective, orally bioavailable 5-HT2A receptor antagonists for the treatment of sleep disorders. Bioorg Med Chem Lett20:3708-12 (2010) 
 
5-hydroxytryptamine receptor 2A
Name:5-hydroxytryptamine receptor 2A
Type:undefined
Mol. Mass.:52607.65
Organism:Homo sapiens (Human)
Description:P28223
Residue:471
BDBM50185780
NameBDBM50185780
Synonyms:(4-(2,4-difluorophenethyl)piperidin-1-yl)(2-fluorophenyl)methanone | CHEMBL210230
TypeSmall organic molecule
Emp. Form.C20H20F3NO
Mol. Mass.347.3741
SMILESFc1ccc(CCC2CCN(CC2)C(=O)c2ccccc2F)c(F)c1