Reaction Details
Target5-hydroxytryptamine receptor 2A
LigandBDBM50320376
Substrate/Competitorn/a
Meas. Tech.ChEMBL_633900 (CHEMBL1120466)
Ki 0.22±n/a nM
Citation Ladduwahetty, TGilligan, MHumphries, AMerchant, KJFish, RMcAlister, GIvarsson, MDominguez, MO'Connor, DMacLeod, AM Non-basic ligands for aminergic GPCRs: the discovery and development diaryl sulfones as selective, orally bioavailable 5-HT2A receptor antagonists for the treatment of sleep disorders. Bioorg Med Chem Lett20:3708-12 (2010) 
 
5-hydroxytryptamine receptor 2A
Name:5-hydroxytryptamine receptor 2A
Type:undefined
Mol. Mass.:52607.65
Organism:Homo sapiens (Human)
Description:P28223
Residue:471
BDBM50320376
NameBDBM50320376
Synonyms:(S,E)-1-(2-(4-(4-fluorostyryl)phenylsulfonyl)phenyl)ethanol | CHEMBL1084976
TypeSmall organic molecule
Emp. Form.C22H19FO3S
Mol. Mass.382.448
SMILESC[C@H](O)c1ccccc1S(=O)(=O)c1ccc(\C=C\c2ccc(F)cc2)cc1