Reaction Details
TargetMatrix metalloproteinase-9
LigandBDBM50320444
Substrate/Competitorn/a
Meas. Tech.ChEMBL_634123 (CHEMBL1119130)
IC50>10000±n/a nM
Citation Kolodziej, SAHockerman, SLDeCrescenzo, GAMcDonald, JJMischke, DAMunie, GEFletcher, TRStehle, NSwearingen, CBecker, DP MMP-13 selective isonipecotamide alpha-sulfone hydroxamates. Bioorg Med Chem Lett20:3561-4 (2010) 
 
Matrix metalloproteinase-9
Name:Matrix metalloproteinase-9
Type:Enzyme
Mol. Mass.:78452.28
Organism:Homo sapiens (Human)
Description:P14780
Residue:707
BDBM50320444
NameBDBM50320444
Synonyms:1-cyclopropyl-4-(4-(4-(4-(2,3-dimethylphenyl)piperazine-1-carbonyl)piperidin-1-yl)phenylsulfonyl)-N-hydroxypiperidine-4-carboxamide | CHEMBL1082318
TypeSmall organic molecule
Emp. Form.C33H45N5O5S
Mol. Mass.623.806
SMILESCc1cccc(N2CCN(CC2)C(=O)C2CCN(CC2)c2ccc(cc2)S(=O)(=O)C2(CCN(CC2)C2CC2)C(=O)NO)c1C