Reaction Details
Target72 kDa type IV collagenase
LigandBDBM50320422
Substrate/Competitorn/a
Meas. Tech.ChEMBL_634117 (CHEMBL1119124)
IC50 2100±n/a nM
Citation Kolodziej, SAHockerman, SLDeCrescenzo, GAMcDonald, JJMischke, DAMunie, GEFletcher, TRStehle, NSwearingen, CBecker, DP MMP-13 selective isonipecotamide alpha-sulfone hydroxamates. Bioorg Med Chem Lett20:3561-4 (2010) 
 
72 kDa type IV collagenase
Name:72 kDa type IV collagenase
Type:Enzyme
Mol. Mass.:73870.36
Organism:Homo sapiens (Human)
Description: P08253
Residue:660
BDBM50320422
NameBDBM50320422
Synonyms:CHEMBL1082324 | N-hydroxy-4-(4-(4-(1,2,3,4-tetrahydroisoquinoline-2-carbonyl)piperidin-1-yl)phenylsulfonyl)tetrahydro-2H-pyran-4-carboxamide
TypeSmall organic molecule
Emp. Form.C27H33N3O6S
Mol. Mass.527.632
SMILESONC(=O)C1(CCOCC1)S(=O)(=O)c1ccc(cc1)N1CCC(CC1)C(=O)N1CCc2ccccc2C1