Reaction Details
Target72 kDa type IV collagenase
LigandBDBM50320424
Substrate/Competitorn/a
Meas. Tech.ChEMBL_634117 (CHEMBL1119124)
IC50 7300±n/a nM
Citation Kolodziej, SAHockerman, SLDeCrescenzo, GAMcDonald, JJMischke, DAMunie, GEFletcher, TRStehle, NSwearingen, CBecker, DP MMP-13 selective isonipecotamide alpha-sulfone hydroxamates. Bioorg Med Chem Lett20:3561-4 (2010) 
 
72 kDa type IV collagenase
Name:72 kDa type IV collagenase
Type:Enzyme
Mol. Mass.:73870.36
Organism:Homo sapiens (Human)
Description: P08253
Residue:660
BDBM50320424
NameBDBM50320424
Synonyms:4-(4-(4-(3,5-dimethylpiperazine-1-carbonyl)piperidin-1-yl)phenylsulfonyl)-N-hydroxytetrahydro-2H-pyran-4-carboxamide | CHEMBL1082325
TypeSmall organic molecule
Emp. Form.C24H36N4O6S
Mol. Mass.508.631
SMILESCC1CN(CC(C)N1)C(=O)C1CCN(CC1)c1ccc(cc1)S(=O)(=O)C1(CCOCC1)C(=O)NO