Reaction Details
Target72 kDa type IV collagenase
LigandBDBM50320436
Substrate/Competitorn/a
Meas. Tech.ChEMBL_634117 (CHEMBL1119124)
IC50 700±n/a nM
Citation Kolodziej, SAHockerman, SLDeCrescenzo, GAMcDonald, JJMischke, DAMunie, GEFletcher, TRStehle, NSwearingen, CBecker, DP MMP-13 selective isonipecotamide alpha-sulfone hydroxamates. Bioorg Med Chem Lett20:3561-4 (2010) 
 
72 kDa type IV collagenase
Name:72 kDa type IV collagenase
Type:Enzyme
Mol. Mass.:73870.36
Organism:Homo sapiens (Human)
Description: P08253
Residue:660
BDBM50320436
NameBDBM50320436
Synonyms:4-(4-(4-(4-(4-acetylphenyl)piperazine-1-carbonyl)piperidin-1-yl)phenylsulfonyl)-N-hydroxytetrahydro-2H-pyran-4-carboxamide | CHEMBL1083585
TypeSmall organic molecule
Emp. Form.C30H38N4O7S
Mol. Mass.598.71
SMILESCC(=O)c1ccc(cc1)N1CCN(CC1)C(=O)C1CCN(CC1)c1ccc(cc1)S(=O)(=O)C1(CCOCC1)C(=O)NO