Reaction Details
TargetCollagenase 3
LigandBDBM50320419
Substrate/Competitorn/a
Meas. Tech.ChEMBL_634118 (CHEMBL1119125)
IC50 35±n/a nM
Citation Kolodziej, SAHockerman, SLDeCrescenzo, GAMcDonald, JJMischke, DAMunie, GEFletcher, TRStehle, NSwearingen, CBecker, DP MMP-13 selective isonipecotamide alpha-sulfone hydroxamates. Bioorg Med Chem Lett20:3561-4 (2010) 
 
Collagenase 3
Name:Collagenase 3
Type:Enzyme
Mol. Mass.:53808.06
Organism:Homo sapiens (Human)
Description:P45452
Residue:471
BDBM50320419
NameBDBM50320419
Synonyms:CHEMBL1083030 | N-allyl-1-(4-(4-(hydroxycarbamoyl)tetrahydro-2H-pyran-4-ylsulfonyl)phenyl)-N-methylpiperidine-4-carboxamide
TypeSmall organic molecule
Emp. Form.C22H31N3O6S
Mol. Mass.465.563
SMILESCN(CC=C)C(=O)C1CCN(CC1)c1ccc(cc1)S(=O)(=O)C1(CCOCC1)C(=O)NO