Reaction Details
TargetCollagenase 3
LigandBDBM50320420
Substrate/Competitorn/a
Meas. Tech.ChEMBL_634118 (CHEMBL1119125)
IC50 25±n/a nM
Citation Kolodziej, SAHockerman, SLDeCrescenzo, GAMcDonald, JJMischke, DAMunie, GEFletcher, TRStehle, NSwearingen, CBecker, DP MMP-13 selective isonipecotamide alpha-sulfone hydroxamates. Bioorg Med Chem Lett20:3561-4 (2010) 
 
Collagenase 3
Name:Collagenase 3
Type:Enzyme
Mol. Mass.:53808.06
Organism:Homo sapiens (Human)
Description:P45452
Residue:471
BDBM50320420
NameBDBM50320420
Synonyms:1-(4-(4-(hydroxycarbamoyl)tetrahydro-2H-pyran-4-ylsulfonyl)phenyl)-N-methyl-N-(prop-2-ynyl)piperidine-4-carboxamide | CHEMBL1083336
TypeSmall organic molecule
Emp. Form.C22H29N3O6S
Mol. Mass.463.547
SMILESCN(CC#C)C(=O)C1CCN(CC1)c1ccc(cc1)S(=O)(=O)C1(CCOCC1)C(=O)NO