Reaction Details
TargetCollagenase 3
LigandBDBM50320429
Substrate/Competitorn/a
Meas. Tech.ChEMBL_634118 (CHEMBL1119125)
IC50 45±n/a nM
Citation Kolodziej, SAHockerman, SLDeCrescenzo, GAMcDonald, JJMischke, DAMunie, GEFletcher, TRStehle, NSwearingen, CBecker, DP MMP-13 selective isonipecotamide alpha-sulfone hydroxamates. Bioorg Med Chem Lett20:3561-4 (2010) 
 
Collagenase 3
Name:Collagenase 3
Type:Enzyme
Mol. Mass.:53808.06
Organism:Homo sapiens (Human)
Description:P45452
Residue:471
BDBM50320429
NameBDBM50320429
Synonyms:CHEMBL1083606 | N-hydroxy-4-(4-(4-(4-(2-methoxyethyl)piperazine-1-carbonyl)piperidin-1-yl)phenylsulfonyl)tetrahydro-2H-pyran-4-carboxamide
TypeSmall organic molecule
Emp. Form.C25H38N4O7S
Mol. Mass.538.657
SMILESCOCCN1CCN(CC1)C(=O)C1CCN(CC1)c1ccc(cc1)S(=O)(=O)C1(CCOCC1)C(=O)NO