Reaction Details
Target72 kDa type IV collagenase
LigandBDBM50320442
Substrate/Competitorn/a
Meas. Tech.ChEMBL_634117 (CHEMBL1119124)
IC50 400±n/a nM
Citation Kolodziej, SAHockerman, SLDeCrescenzo, GAMcDonald, JJMischke, DAMunie, GEFletcher, TRStehle, NSwearingen, CBecker, DP MMP-13 selective isonipecotamide alpha-sulfone hydroxamates. Bioorg Med Chem Lett20:3561-4 (2010) 
 
72 kDa type IV collagenase
Name:72 kDa type IV collagenase
Type:Enzyme
Mol. Mass.:73870.36
Organism:Homo sapiens (Human)
Description: P08253
Residue:660
BDBM50320442
NameBDBM50320442
Synonyms:CHEMBL1085257 | N-hydroxy-1-(2-methoxyethyl)-4-(4-(4-(phenylcarbamoyl)piperidin-1-yl)phenylsulfonyl)piperidine-4-carboxamide
TypeSmall organic molecule
Emp. Form.C27H36N4O6S
Mol. Mass.544.663
SMILESCOCCN1CCC(CC1)(C(=O)NO)S(=O)(=O)c1ccc(cc1)N1CCC(CC1)C(=O)Nc1ccccc1