Reaction Details
TargetInterstitial collagenase
LigandBDBM50320442
Substrate/Competitorn/a
Meas. Tech.ChEMBL_634119 (CHEMBL1119126)
IC50 10000±n/a nM
Citation Kolodziej, SAHockerman, SLDeCrescenzo, GAMcDonald, JJMischke, DAMunie, GEFletcher, TRStehle, NSwearingen, CBecker, DP MMP-13 selective isonipecotamide alpha-sulfone hydroxamates. Bioorg Med Chem Lett20:3561-4 (2010) 
 
Interstitial collagenase
Name:Interstitial collagenase
Type:Enzyme
Mol. Mass.:54010.26
Organism:Homo sapiens (Human)
Description: P03956
Residue:469
BDBM50320442
NameBDBM50320442
Synonyms:CHEMBL1085257 | N-hydroxy-1-(2-methoxyethyl)-4-(4-(4-(phenylcarbamoyl)piperidin-1-yl)phenylsulfonyl)piperidine-4-carboxamide
TypeSmall organic molecule
Emp. Form.C27H36N4O6S
Mol. Mass.544.663
SMILESCOCCN1CCC(CC1)(C(=O)NO)S(=O)(=O)c1ccc(cc1)N1CCC(CC1)C(=O)Nc1ccccc1