Reaction Details
TargetUrotensin-2 receptor
LigandBDBM50320466
Substrate/Competitorn/a
Meas. Tech.ChEMBL_636751 (CHEMBL1167040)
Ki 15±n/a nM
Citation Maryanoff, BEKinney, WA Urotensin-II receptor modulators as potential drugs. J Med Chem53:2695-708 (2010) 
 
Urotensin-2 receptor
Name:Urotensin-2 receptor
Type:Enzyme Catalytic Domain
Mol. Mass.:42725.34
Organism:RAT
Description:Urotensin-II UTS2R RAT::P49684
Residue:386
BDBM50320466
NameBDBM50320466
Synonyms:Ac-[CFWKYC]-NH2 | CHEMBL1165794
TypeSmall organic molecule
Emp. Form.C43H53N9O8S2
Mol. Mass.888.066
SMILESCC(=O)N[C@H]1CSSC[C@H](NC(=O)[C@H](Cc2ccc(O)cc2)NC(=O)[C@H](CCCCN)NC(=O)[C@H](Cc2c[nH]c3ccccc23)NC(=O)[C@H](Cc2ccccc2)NC1=O)C(N)=O