Reaction Details
TargetUrotensin-2 receptor
LigandBDBM50320471
Substrate/Competitorn/a
Meas. Tech.ChEMBL_636751 (CHEMBL1167040)
Ki 4.1±n/a nM
Citation Maryanoff, BEKinney, WA Urotensin-II receptor modulators as potential drugs. J Med Chem53:2695-708 (2010) 
 
Urotensin-2 receptor
Name:Urotensin-2 receptor
Type:Enzyme Catalytic Domain
Mol. Mass.:42725.34
Organism:RAT
Description:Urotensin-II UTS2R RAT::P49684
Residue:386
BDBM50320471
NameBDBM50320471
Synonyms:(4R,7S,10S,13S,16S,19R)-13-((1H-indol-3-yl)methyl)-19-acetamido-10-(4-aminobutyl)-16-benzyl-7-(naphthalen-1-ylmethyl)-6,9,12,15,18-pentaoxo-1,2-dithia-5,8,11,14,17-pentaazacycloicosane-4-carboxamide | CHEMBL1165796
TypeSmall organic molecule
Emp. Form.C47H55N9O7S2
Mol. Mass.922.126
SMILESCC(=O)N[C@H]1CSSC[C@H](NC(=O)[C@H](Cc2cccc3ccccc23)NC(=O)[C@H](CCCCN)NC(=O)[C@H](Cc2c[nH]c3ccccc23)NC(=O)[C@H](Cc2ccccc2)NC1=O)C(N)=O