Reaction Details
TargetUrotensin-2 receptor
LigandBDBM50302274
Substrate/Competitorn/a
Meas. Tech.ChEMBL_636746 (CHEMBL1167035)
Ki 6.3±n/a nM
Citation Maryanoff, BEKinney, WA Urotensin-II receptor modulators as potential drugs. J Med Chem53:2695-708 (2010) 
 
Urotensin-2 receptor
Name:Urotensin-2 receptor
Type:Enzyme Catalytic Domain
Mol. Mass.:42725.34
Organism:RAT
Description:Urotensin-II UTS2R RAT::P49684
Residue:386
BDBM50302274
NameBDBM50302274
Synonyms:(4R,10bR)-4-(3,4-dimethoxyphenyl)-10-(4-ethylpiperazin-1-yl)-1,2,3,4-tetrahydropyrido[2,1-a]isoindol-6(10bH)-one | CHEMBL566894
TypeSmall organic molecule
Emp. Form.C26H33N3O3
Mol. Mass.435.5585
SMILESCCN1CCN(CC1)c1cccc2C(=O)N3[C@H](CCC[C@@H]3c3ccc(OC)c(OC)c3)c12