Reaction Details
TargetCarbonic anhydrase 9
LigandBDBM50320512
Substrate/Competitorn/a
Meas. Tech.ChEMBL_637717 (CHEMBL1167308)
Ki 7.8±n/a nM
Citation Brzozowski, ZSlawinski, JSaczewski, FInnocenti, ASupuran, CT Carbonic anhydrase inhibitors: synthesis and inhibition of the human cytosolic isozymes I and II and transmembrane isozymes IX, XII (cancer-associated) and XIV with 4-substituted 3-pyridinesulfonamides. Eur J Med Chem45:2396-404 (2010) 
 
Carbonic anhydrase 9
Name:Carbonic anhydrase 9
Type:Enzyme
Mol. Mass.:49669.03
Organism:Homo sapiens (Human)
Description:Catalytic domain of human cloned isozyme was used in the assay
Residue:459
BDBM50320512
NameBDBM50320512
Synonyms:4-(5-Methyl-2-pirazolino)-3-pyridinesulfonamide | CHEMBL1163382
TypeSmall organic molecule
Emp. Form.C9H12N4O2S
Mol. Mass.240.282
SMILESCC1CC=NN1c1ccncc1S(N)(=O)=O