Reaction Details
TargetCarbonic anhydrase 9
LigandBDBM50320516
Substrate/Competitorn/a
Meas. Tech.ChEMBL_637717 (CHEMBL1167308)
Ki 6.3±n/a nM
Citation Brzozowski, ZSlawinski, JSaczewski, FInnocenti, ASupuran, CT Carbonic anhydrase inhibitors: synthesis and inhibition of the human cytosolic isozymes I and II and transmembrane isozymes IX, XII (cancer-associated) and XIV with 4-substituted 3-pyridinesulfonamides. Eur J Med Chem45:2396-404 (2010) 
 
Carbonic anhydrase 9
Name:Carbonic anhydrase 9
Type:Enzyme
Mol. Mass.:49669.03
Organism:Homo sapiens (Human)
Description:Catalytic domain of human cloned isozyme was used in the assay
Residue:459
BDBM50320516
NameBDBM50320516
Synonyms:4-(2-Propynylthio)pyridine-3-sulfonamide | CHEMBL1164486
TypeSmall organic molecule
Emp. Form.C8H8N2O2S2
Mol. Mass.228.291
SMILESNS(=O)(=O)c1cnccc1SCC#C