Reaction Details
TargetCarbonic anhydrase 9
LigandBDBM50320501
Substrate/Competitorn/a
Meas. Tech.ChEMBL_637717 (CHEMBL1167308)
Ki 9.1±n/a nM
Citation Brzozowski, ZSlawinski, JSaczewski, FInnocenti, ASupuran, CT Carbonic anhydrase inhibitors: synthesis and inhibition of the human cytosolic isozymes I and II and transmembrane isozymes IX, XII (cancer-associated) and XIV with 4-substituted 3-pyridinesulfonamides. Eur J Med Chem45:2396-404 (2010) 
 
Carbonic anhydrase 9
Name:Carbonic anhydrase 9
Type:Enzyme
Mol. Mass.:49669.03
Organism:Homo sapiens (Human)
Description:Catalytic domain of human cloned isozyme was used in the assay
Residue:459
BDBM50320501
NameBDBM50320501
Synonyms:4-(Quinolinoxy)-3-pyridinesulfonamide | CHEMBL1165726
TypeSmall organic molecule
Emp. Form.C14H11N3O3S
Mol. Mass.301.32
SMILESNS(=O)(=O)c1cnccc1Oc1cccc2cccnc12