Reaction Details
TargetCarbonic anhydrase 2
LigandBDBM50320508
Substrate/Competitorn/a
Meas. Tech.ChEMBL_637716 (CHEMBL1167307)
Ki 88.3±n/a nM
Citation Brzozowski, ZSlawinski, JSaczewski, FInnocenti, ASupuran, CT Carbonic anhydrase inhibitors: synthesis and inhibition of the human cytosolic isozymes I and II and transmembrane isozymes IX, XII (cancer-associated) and XIV with 4-substituted 3-pyridinesulfonamides. Eur J Med Chem45:2396-404 (2010) 
 
Carbonic anhydrase 2
Name:Carbonic anhydrase 2
Type:Enzyme
Mol. Mass.:29250.71
Organism:Homo sapiens (Human)
Description:P00918
Residue:260
BDBM50320508
NameBDBM50320508
Synonyms:4-[N'-(6-Chloro-7-cyano-1,1-dioxo-1,4,2-benzodithiazin-3-yl)hydrazino]-3-pyridinesulfonamide | CHEMBL1165062
TypeSmall organic molecule
Emp. Form.C13H9ClN6O4S3
Mol. Mass.444.896
SMILESNS(=O)(=O)c1cnccc1NN=C1NS(=O)(=O)c2cc(C#N)c(Cl)cc2S1