Reaction Details
TargetCarbonic anhydrase 2
LigandBDBM50320509
Substrate/Competitorn/a
Meas. Tech.ChEMBL_637716 (CHEMBL1167307)
Ki 52±n/a nM
Citation Brzozowski, ZSlawinski, JSaczewski, FInnocenti, ASupuran, CT Carbonic anhydrase inhibitors: synthesis and inhibition of the human cytosolic isozymes I and II and transmembrane isozymes IX, XII (cancer-associated) and XIV with 4-substituted 3-pyridinesulfonamides. Eur J Med Chem45:2396-404 (2010) 
 
Carbonic anhydrase 2
Name:Carbonic anhydrase 2
Type:Enzyme
Mol. Mass.:29250.71
Organism:Homo sapiens (Human)
Description:P00918
Residue:260
BDBM50320509
NameBDBM50320509
Synonyms:4-[2-(4-Sulfamoylphenyl)ethylamino]-3-pyridinosulfonamide | CHEMBL1165061
TypeSmall organic molecule
Emp. Form.C13H16N4O4S2
Mol. Mass.356.421
SMILESNS(=O)(=O)c1ccc(CCNc2ccncc2S(N)(=O)=O)cc1