Reaction Details
TargetCarbonic anhydrase 2
LigandBDBM50320512
Substrate/Competitorn/a
Meas. Tech.ChEMBL_637716 (CHEMBL1167307)
Ki 140±n/a nM
Citation Brzozowski, ZSlawinski, JSaczewski, FInnocenti, ASupuran, CT Carbonic anhydrase inhibitors: synthesis and inhibition of the human cytosolic isozymes I and II and transmembrane isozymes IX, XII (cancer-associated) and XIV with 4-substituted 3-pyridinesulfonamides. Eur J Med Chem45:2396-404 (2010) 
 
Carbonic anhydrase 2
Name:Carbonic anhydrase 2
Type:Enzyme
Mol. Mass.:29250.71
Organism:Homo sapiens (Human)
Description:P00918
Residue:260
BDBM50320512
NameBDBM50320512
Synonyms:4-(5-Methyl-2-pirazolino)-3-pyridinesulfonamide | CHEMBL1163382
TypeSmall organic molecule
Emp. Form.C9H12N4O2S
Mol. Mass.240.282
SMILESCC1CC=NN1c1ccncc1S(N)(=O)=O