Reaction Details
TargetCarbonic anhydrase 1
LigandBDBM50320507
Substrate/Competitorn/a
Meas. Tech.ChEMBL_637715 (CHEMBL1167306)
Ki 101±n/a nM
Citation Brzozowski, ZSlawinski, JSaczewski, FInnocenti, ASupuran, CT Carbonic anhydrase inhibitors: synthesis and inhibition of the human cytosolic isozymes I and II and transmembrane isozymes IX, XII (cancer-associated) and XIV with 4-substituted 3-pyridinesulfonamides. Eur J Med Chem45:2396-404 (2010) 
 
Carbonic anhydrase 1
Name:Carbonic anhydrase 1
Type:Enzyme
Mol. Mass.:28873.37
Organism:Homo sapiens (Human)
Description:P00915
Residue:261
BDBM50320507
NameBDBM50320507
Synonyms:4-[N'-(6-Chloro-7-methyl-1,1-dioxo-1,4,2-benzodithiazin-3-yl)hydrazyno]-3-pyridinesulfonamide | CHEMBL1165822
TypeSmall organic molecule
Emp. Form.C13H12ClN5O4S3
Mol. Mass.433.913
SMILESCc1cc2c(SC(NS2(=O)=O)=NNc2ccncc2S(N)(=O)=O)cc1Cl