Reaction Details
TargetCarbonic anhydrase 1
LigandBDBM50320521
Substrate/Competitorn/a
Meas. Tech.ChEMBL_637715 (CHEMBL1167306)
Ki 6670±n/a nM
Citation Brzozowski, ZSlawinski, JSaczewski, FInnocenti, ASupuran, CT Carbonic anhydrase inhibitors: synthesis and inhibition of the human cytosolic isozymes I and II and transmembrane isozymes IX, XII (cancer-associated) and XIV with 4-substituted 3-pyridinesulfonamides. Eur J Med Chem45:2396-404 (2010) 
 
Carbonic anhydrase 1
Name:Carbonic anhydrase 1
Type:Enzyme
Mol. Mass.:28873.37
Organism:Homo sapiens (Human)
Description:P00915
Residue:261
BDBM50320521
NameBDBM50320521
Synonyms:4-(1,3,4-Thiadiozol-2-ylthio)pyridine-3-sulfonamide | CHEMBL1165005
TypeSmall organic molecule
Emp. Form.C6H5N5O2S3
Mol. Mass.275.331
SMILESNS(=O)(=O)c1cnccc1Sc1nnns1