Reaction Details
TargetCarbonic anhydrase 1
LigandBDBM50320499
Substrate/Competitorn/a
Meas. Tech.ChEMBL_637715 (CHEMBL1167306)
Ki 7620±n/a nM
Citation Brzozowski, ZSlawinski, JSaczewski, FInnocenti, ASupuran, CT Carbonic anhydrase inhibitors: synthesis and inhibition of the human cytosolic isozymes I and II and transmembrane isozymes IX, XII (cancer-associated) and XIV with 4-substituted 3-pyridinesulfonamides. Eur J Med Chem45:2396-404 (2010) 
 
Carbonic anhydrase 1
Name:Carbonic anhydrase 1
Type:Enzyme
Mol. Mass.:28873.37
Organism:Homo sapiens (Human)
Description:P00915
Residue:261
BDBM50320499
NameBDBM50320499
Synonyms:4-(N-Oxide-2-pyridylthio)pyridine-3-sulfonamide | CHEMBL1165118
TypeSmall organic molecule
Emp. Form.C10H9N3O3S2
Mol. Mass.283.327
SMILESNS(=O)(=O)c1cnccc1Sc1cccc[n+]1[O-]