Reaction Details
TargetCarbonic anhydrase 12
LigandBDBM50320522
Substrate/Competitorn/a
Meas. Tech.ChEMBL_637718 (CHEMBL1167309)
Ki 4.2±n/a nM
Citation Brzozowski, ZSlawinski, JSaczewski, FInnocenti, ASupuran, CT Carbonic anhydrase inhibitors: synthesis and inhibition of the human cytosolic isozymes I and II and transmembrane isozymes IX, XII (cancer-associated) and XIV with 4-substituted 3-pyridinesulfonamides. Eur J Med Chem45:2396-404 (2010) 
 
Carbonic anhydrase 12
Name:Carbonic anhydrase 12
Type:Enzyme
Mol. Mass.:39456.00
Organism:Homo sapiens (Human)
Description:Catalytic domain of human cloned isozyme was used in the assay
Residue:354
BDBM50320522
NameBDBM50320522
Synonyms:4-(1-Methyl-5-tetrazolylthio)pyridine-3-sulfonamide | CHEMBL1165072
TypeSmall organic molecule
Emp. Form.C7H8N6O2S2
Mol. Mass.272.307
SMILESCn1nnnc1Sc1ccncc1S(N)(=O)=O