Reaction Details
TargetCarbonic anhydrase 12
LigandBDBM50320513
Substrate/Competitorn/a
Meas. Tech.ChEMBL_637718 (CHEMBL1167309)
Ki 16.9±n/a nM
Citation Brzozowski, ZSlawinski, JSaczewski, FInnocenti, ASupuran, CT Carbonic anhydrase inhibitors: synthesis and inhibition of the human cytosolic isozymes I and II and transmembrane isozymes IX, XII (cancer-associated) and XIV with 4-substituted 3-pyridinesulfonamides. Eur J Med Chem45:2396-404 (2010) 
 
Carbonic anhydrase 12
Name:Carbonic anhydrase 12
Type:Enzyme
Mol. Mass.:39456.00
Organism:Homo sapiens (Human)
Description:Catalytic domain of human cloned isozyme was used in the assay
Residue:354
BDBM50320513
NameBDBM50320513
Synonyms:4-(Allylamino)-3-pyridinesulfonamide | CHEMBL1164966
TypeSmall organic molecule
Emp. Form.C8H11N3O2S
Mol. Mass.213.257
SMILESNS(=O)(=O)c1cnccc1NCC=C