Reaction Details
TargetCarbonic anhydrase 14
LigandBDBM50320513
Substrate/Competitorn/a
Meas. Tech.ChEMBL_637719 (CHEMBL1167310)
Ki 143±n/a nM
Citation Brzozowski, ZSlawinski, JSaczewski, FInnocenti, ASupuran, CT Carbonic anhydrase inhibitors: synthesis and inhibition of the human cytosolic isozymes I and II and transmembrane isozymes IX, XII (cancer-associated) and XIV with 4-substituted 3-pyridinesulfonamides. Eur J Med Chem45:2396-404 (2010) 
 
Carbonic anhydrase 14
Name:Carbonic anhydrase 14
Type:Enzyme
Mol. Mass.:37665.67
Organism:Homo sapiens (Human)
Description:Human (cloned) isozyme.
Residue:337
BDBM50320513
NameBDBM50320513
Synonyms:4-(Allylamino)-3-pyridinesulfonamide | CHEMBL1164966
TypeSmall organic molecule
Emp. Form.C8H11N3O2S
Mol. Mass.213.257
SMILESNS(=O)(=O)c1cnccc1NCC=C