Reaction Details
TargetCarbonic anhydrase 14
LigandBDBM50320511
Substrate/Competitorn/a
Meas. Tech.ChEMBL_637719 (CHEMBL1167310)
Ki 95.7±n/a nM
Citation Brzozowski, ZSlawinski, JSaczewski, FInnocenti, ASupuran, CT Carbonic anhydrase inhibitors: synthesis and inhibition of the human cytosolic isozymes I and II and transmembrane isozymes IX, XII (cancer-associated) and XIV with 4-substituted 3-pyridinesulfonamides. Eur J Med Chem45:2396-404 (2010) 
 
Carbonic anhydrase 14
Name:Carbonic anhydrase 14
Type:Enzyme
Mol. Mass.:37665.67
Organism:Homo sapiens (Human)
Description:Human (cloned) isozyme.
Residue:337
BDBM50320511
NameBDBM50320511
Synonyms:4-(Methylhydrazino)-3-pyridinesulfonamide | CHEMBL1164878
TypeSmall organic molecule
Emp. Form.C6H10N4O2S
Mol. Mass.202.234
SMILESCNNc1ccncc1S(N)(=O)=O