Reaction Details
TargetCarbonic anhydrase 14
LigandBDBM50320509
Substrate/Competitorn/a
Meas. Tech.ChEMBL_637719 (CHEMBL1167310)
Ki 149±n/a nM
Citation Brzozowski, ZSlawinski, JSaczewski, FInnocenti, ASupuran, CT Carbonic anhydrase inhibitors: synthesis and inhibition of the human cytosolic isozymes I and II and transmembrane isozymes IX, XII (cancer-associated) and XIV with 4-substituted 3-pyridinesulfonamides. Eur J Med Chem45:2396-404 (2010) 
 
Carbonic anhydrase 14
Name:Carbonic anhydrase 14
Type:Enzyme
Mol. Mass.:37665.67
Organism:Homo sapiens (Human)
Description:Human (cloned) isozyme.
Residue:337
BDBM50320509
NameBDBM50320509
Synonyms:4-[2-(4-Sulfamoylphenyl)ethylamino]-3-pyridinosulfonamide | CHEMBL1165061
TypeSmall organic molecule
Emp. Form.C13H16N4O4S2
Mol. Mass.356.421
SMILESNS(=O)(=O)c1ccc(CCNc2ccncc2S(N)(=O)=O)cc1