Reaction Details
TargetHistone deacetylase 1
LigandBDBM19423
Substrate/Competitorn/a
Meas. Tech.ChEMBL_638007 (CHEMBL1166728)
IC50 40±n/a nM
Citation Bertrand, P Inside HDAC with HDAC inhibitors. Eur J Med Chem45:2095-116 (2010) 
 
Histone deacetylase 1
Name:Histone deacetylase 1
Type:Enzyme
Mol. Mass.:55090.27
Organism:Homo sapiens (Human)
Description:Q13547
Residue:482
BDBM19423
NameBDBM19423
Synonyms:HDAC inhibitor, Compound 1 N-[2-amino-5-(thiophen-2-yl)phenyl]-4-acetamidobenzamide (60) benzamide-type inhibitor, 19
TypeSmall organic molecule
Emp. Form.C19H17N3O2S
Mol. Mass.351.422
SMILESCC(=O)Nc1ccc(cc1)C(=O)Nc1cc(ccc1N)-c1cccs1