Reaction Details
TargetBeta-secretase 1
LigandBDBM16736
Substrate/Competitorn/a
Meas. Tech.ChEMBL_638726 (CHEMBL1169087)
IC50 79±n/a nM
Citation Al-Nadaf, AAbu Sheikha, GTaha, MO Elaborate ligand-based pharmacophore exploration and QSAR analysis guide the synthesis of novel pyridinium-based potent beta-secretase inhibitory leads. Bioorg Med Chem18:3088-115 (2010) 
 
Beta-secretase 1
Name:Beta-secretase 1
Type:Protein
Mol. Mass.:55755.10
Organism:Homo sapiens (Human)
Description:P56817
Residue:501
BDBM16736
NameBDBM16736
Synonyms:N-[2-(4-benzoylpiperazin-1-yl)-5-phenylphenyl]naphthalene-1-carboxamide | Naphthyl Compound, 6a
TypeSmall organic molecule
Emp. Form.C34H29N3O2
Mol. Mass.511.613
SMILESO=C(Nc1cc(ccc1N1CCN(CC1)C(=O)c1ccccc1)-c1ccccc1)c1cccc2ccccc12