Reaction Details
TargetKiSS-1 receptor
LigandBDBM50320811
Substrate/Competitorn/a
Meas. Tech.ChEMBL_639178 (CHEMBL1167874)
IC50 9.80±n/a nM
Citation Kobayashi, TSasaki, STomita, NFukui, SKuroda, NNakayama, MKiba, ATakatsu, YOhtaki, TItoh, FBaba, A Synthesis and structure-activity relationships of 2-acylamino-4,6-diphenylpyridine derivatives as novel antagonists of GPR54. Bioorg Med Chem18:3841-59 (2010) 
 
KiSS-1 receptor
Name:KiSS-1 receptor
Type:G Protein-Coupled Receptor (GPCR)
Mol. Mass.:42613.79
Organism:Homo sapiens (Human)
Description:Binding assay was performed using membranes from the CHO cell transfectants.
Residue:398
BDBM50320811
NameBDBM50320811
Synonyms:CHEMBL1163896 | N-{4-[3-(beta-Alanylamino)phenyl]-6-(4-chloro-2-hydroxyphenyl)-3-cyanopyridin-2-yl}thiophene-2-carboxamide
TypeSmall organic molecule
Emp. Form.C26H20ClN5O3S
Mol. Mass.517.987
SMILESNCCC(=O)Nc1cccc(c1)-c1cc(nc(NC(=O)c2cccs2)c1C#N)-c1ccc(Cl)cc1O