Reaction Details
TargetKiSS-1 receptor
LigandBDBM50320822
Substrate/Competitorn/a
Meas. Tech.ChEMBL_639178 (CHEMBL1167874)
IC50 8±n/a nM
Citation Kobayashi, TSasaki, STomita, NFukui, SKuroda, NNakayama, MKiba, ATakatsu, YOhtaki, TItoh, FBaba, A Synthesis and structure-activity relationships of 2-acylamino-4,6-diphenylpyridine derivatives as novel antagonists of GPR54. Bioorg Med Chem18:3841-59 (2010) 
 
KiSS-1 receptor
Name:KiSS-1 receptor
Type:G Protein-Coupled Receptor (GPCR)
Mol. Mass.:42613.79
Organism:Homo sapiens (Human)
Description:Binding assay was performed using membranes from the CHO cell transfectants.
Residue:398
BDBM50320822
NameBDBM50320822
Synonyms:CHEMBL1163736 | N-[4-{3-[(2-Aminoethyl)carbamoyl]phenyl}-3-cyano-6-(4-fluoro-2-hydroxyphenyl)pyridin-2-yl]furan-2-carboxamide
TypeSmall organic molecule
Emp. Form.C26H20FN5O4
Mol. Mass.485.4665
SMILESNCCNC(=O)c1cccc(c1)-c1cc(nc(NC(=O)c2ccco2)c1C#N)-c1ccc(F)cc1O