Reaction Details
TargetSigma non-opioid intracellular receptor 1
LigandBDBM50321759
Substrate/Competitorn/a
Meas. Tech.ChEMBL_641177 (CHEMBL1174684)
Ki 7.70±n/a nM
Citation Oberdorf, CSchmidt, TJWünsch, B 5D-QSAR for spirocyclic sigma1 receptor ligands by Quasar receptor surface modeling. Eur J Med Chem45:3116-24 (2010) 
 
Sigma non-opioid intracellular receptor 1
Name:Sigma non-opioid intracellular receptor 1
Type:Protein
Mol. Mass.:25307.17
Organism:Cavia porcellus (Guinea pig)
Description:Q60492
Residue:223
BDBM50321759
NameBDBM50321759
Synonyms:(R)-1'-benzyl-3-propyl-3H-spiro[isobenzofuran-1,4'-piperidine] | CHEMBL1171419
TypeSmall organic molecule
Emp. Form.C22H27NO
Mol. Mass.321.4559
SMILESCCC[C@H]1OC2(CCN(Cc3ccccc3)CC2)c2ccccc12