Reaction Details
TargetSigma non-opioid intracellular receptor 1
LigandBDBM50321773
Substrate/Competitorn/a
Meas. Tech.ChEMBL_641177 (CHEMBL1174684)
Ki 1720±n/a nM
Citation Oberdorf, CSchmidt, TJWünsch, B 5D-QSAR for spirocyclic sigma1 receptor ligands by Quasar receptor surface modeling. Eur J Med Chem45:3116-24 (2010) 
 
Sigma non-opioid intracellular receptor 1
Name:Sigma non-opioid intracellular receptor 1
Type:Protein
Mol. Mass.:25307.17
Organism:Cavia porcellus (Guinea pig)
Description:Q60492
Residue:223
BDBM50321773
NameBDBM50321773
Synonyms:(R)-1'-benzyl-3-methoxy-4,5-dihydro-3H-spiro[benzo[c]oxepine-1,4'-piperidine] | CHEMBL1170334
TypeSmall organic molecule
Emp. Form.C22H27NO2
Mol. Mass.337.4553
SMILESCO[C@H]1CCc2ccccc2C2(CCN(Cc3ccccc3)CC2)O1