Reaction Details
TargetSigma non-opioid intracellular receptor 1
LigandBDBM50321781
Substrate/Competitorn/a
Meas. Tech.ChEMBL_641177 (CHEMBL1174684)
Ki 0.430±n/a nM
Citation Oberdorf, CSchmidt, TJWünsch, B 5D-QSAR for spirocyclic sigma1 receptor ligands by Quasar receptor surface modeling. Eur J Med Chem45:3116-24 (2010) 
 
Sigma non-opioid intracellular receptor 1
Name:Sigma non-opioid intracellular receptor 1
Type:Protein
Mol. Mass.:25307.17
Organism:Cavia porcellus (Guinea pig)
Description:Q60492
Residue:223
BDBM50321781
NameBDBM50321781
Synonyms:(R)-1-isopropyl-6'-methoxy-1'-phenyl-6',7'-dihydro-1'H-spiro[piperidine-4,4'-pyrano[4,3-c]pyrazole] | CHEMBL1171554
TypeSmall organic molecule
Emp. Form.C20H27N3O2
Mol. Mass.341.4473
SMILESCO[C@H]1Cc2c(cnn2-c2ccccc2)C2(CCN(CC2)C(C)C)O1